Target
Coagulation factor XI
Ligand
BDBM170412
Substrate
Meas. Tech.
In Vitro Assay
Ki
<5.00±n/a nM
Citation
 Orwat, MJPinto, DJSmith, II, LMSrivastava, S Substituted tetrahydroisoquinoline compounds as factor XIa inhibitors US Patent  US9079929 Publication Date 7/14/2015 
Target
Name:
Coagulation factor XI
Synonyms:
Coagulation factor XIa Coagulation factor XIa light chain FA11_HUMAN Factor XIa PTA | Plasma thromboplastin antecedent
Type:
Enzyme
Mol. Mass.:
70130.58
Organism:
Homo sapiens (Human)
Description:
P03951
Residue:
625
  
Inhibitor
Name:
BDBM170412
Synonyms:
US9079929, 108
Type:
Small organic molecule
Emp. Form.:
C32H29ClFN7O5
Mol. Mass.:
646.068
SMILES:
OC(=O)c1ccc(NC(=O)C2N(CCc3c(OC4CCNCC4)cccc23)C(=O)\C=C\c2c(F)c(Cl)ccc2-n2cnnn2)cc1
: