Target
Complement factor D
Ligand
BDBM171305
Substrate
Meas. Tech.
In Vitro Assay
pH
7.5±n/a
Temperature
298.15±n/a K
IC50
3±n/a nM
Comments
extracted
Citation
 Altmann, EHommel, ULorthiois, ELMaibaum, JKOstermann, NQuancard, JRandl, SARogel, OSimic, OVulpetti, A Complement pathway modulators and uses thereof US Patent  US9085555 Publication Date 7/21/2015 
Target
Name:
Complement factor D
Synonyms:
Adipsin CFAD_HUMAN DF Properdin factor D
Type:
Protein
Mol. Mass.:
27039.19
Organism:
Homo sapiens (Human)
Description:
P00746
Residue:
253
  
Inhibitor
Name:
BDBM171305
Synonyms:
US9085555, 735
Type:
Small organic molecule
Emp. Form.:
C22H22BrN7O3
Mol. Mass.:
512.359
SMILES:
CCc1cc2c(nn(CC(=O)N3[C@@H]4C[C@@H]4C[C@H]3C(=O)Nc3cccc(Br)n3)c2cn1)C(N)=O
: