Target
Cathepsin D
Ligand
BDBM171565
Substrate
Meas. Tech.
Fluorescence Resonance Energy Transfer Assay
pH
3.5±n/a
IC50
958610±n/a nM
Comments
extracted
Citation
 Minatti, AELow, JDAllen, JRAmegadzie, ABrown, JFrohn, MJGuzman-Perez, AHarrington, PELopez, PMa, VVNishimura, NQian, WRumfelt, SRzasa, RMSham, KSmith, ALWhite, RXue, Q Perfluorinated cyclopropyl fused 1,3-oxazin-2-amine compounds as beta-secretase inhibitors and methods of use US Patent  US9085576 Publication Date 7/21/2015 
Target
Name:
Cathepsin D
Synonyms:
CATD_HUMAN CTSD Cathepsin D heavy chain Cathepsin D precursor
Type:
Enzyme
Mol. Mass.:
44551.72
Organism:
Homo sapiens (Human)
Description:
Human proCathepsin D (SwissProt accession number P07339) was expressed in Sf9 cells, purified, and autoactivated.
Residue:
412
  
Inhibitor
Name:
BDBM171565
Synonyms:
US9085576, 199 | US9611261, Example 199
Type:
Small organic molecule
Emp. Form.:
C21H19F2N5O3
Mol. Mass.:
427.4041
SMILES:
CC#CCOc1cnc(cn1)C(=O)Nc1ccc(F)c(c1)[C@@]1(CF)N=C(N)O[C@@H]2C[C@H]12
: