Target
Arachidonate 5-lipoxygenase-activating protein
Ligand
BDBM145818
Substrate
Meas. Tech.
Binding Assay
Ki
0.34±n/a nM
Citation
 Chai, WDvorak, CAEccles, WEdwards, JPGoldberg, SDKrawczuk, PJLebsack, ADLiu, JPippel, DJSales, ZSTanis, VMTichenor, MSWiener, JJ 1,2,6-substituted benzimidazoles as flap modulators US Patent  US9089569 Publication Date 7/28/2015 
Target
Name:
Arachidonate 5-lipoxygenase-activating protein
Synonyms:
5-lipoxygenase activating protein 5-lipoxygenase/FLAP ALOX5AP MK-886-binding protein
Type:
Enzyme
Mol. Mass.:
18159.90
Organism:
Homo sapiens (Human)
Description:
P20292
Residue:
161
  
Inhibitor
Name:
BDBM145818
Synonyms:
US8952177, 174 US9695149, 174
Type:
Small organic molecule
Emp. Form.:
C33H35F3N4O3
Mol. Mass.:
592.6512
SMILES:
Cc1cnc(COc2ccc3nc([C@H]4CCCC[C@H]4C(O)=O)n(Cc4ccc(cc4F)N4CCC(F)CC4)c3c2)c(F)c1
: