Target
Histone-lysine N-methyltransferase EZH2 [Y641F]
Ligand
BDBM172183
Substrate
Meas. Tech.
Enzyme Assay
Temperature
298.15±n/a K
IC50
2.82±n/a nM
Comments
extracted
Citation
 Kuntz, KWChesworth, RDuncan, KWKeilhack, HWarholic, NKlaus, CKnutson, SKWigle, TJSeki, MShirotori, SKawano, S Aryl- or heteroaryl-substituted benzene compounds US Patent  US9090562 Publication Date 7/28/2015 
Target
Name:
Histone-lysine N-methyltransferase EZH2 [Y641F]
Synonyms:
EZH2 EZH2_HUMAN KMT6
Type:
Mol. Mass.:
85351.84
Organism:
Homo sapiens (Human)
Description:
Q15910[Y641F]
Residue:
746
  
Inhibitor
Name:
BDBM172183
Synonyms:
US10155002, Compound 191 US9090562, 191
Type:
Small organic molecule
Emp. Form.:
C35H47N5O4
Mol. Mass.:
601.7788
SMILES:
CCCc1cc(C)[nH]c(=O)c1CNC(=O)c1cc(cc(N(CC)C2CCOCC2)c1C)-c1ccc(CN2CCOCC2)nc1
: