Target
Histone deacetylase 1
Ligand
BDBM172834
Substrate
Meas. Tech.
Flag Assay
IC50
180±n/a nM
Citation
 Harrington, PHeidebrecht, Jr., RWKattar, SMiller, TAOtte, KMSiliphaivanh, PStanton, MGTempest, PWilson, KJWitter, DJ 4-carboxybenzylamino derivatives as histone deacetylase inhibitors US Patent  US9096559 Publication Date 8/4/2015 
Target
Name:
Histone deacetylase 1
Synonyms:
Cereblon/Histone deacetylase 1 HDAC1 Histone deacetylase 1 (HDAC1) RPD3L1
Type:
Enzyme
Mol. Mass.:
55090.27
Organism:
Homo sapiens (Human)
Description:
Q13547
Residue:
482
  
Inhibitor
Name:
BDBM172834
Synonyms:
US9096559, 70
Type:
Small organic molecule
Emp. Form.:
C24H22N4OS
Mol. Mass.:
414.523
SMILES:
Cc1cscc1-c1ccc(N)c(NC(=O)c2ccc(CNc3ccncc3)cc2)c1
: