Target
cAMP and cAMP-inhibited cGMP 3',5'-cyclic phosphodiesterase 10A
Ligand
BDBM173111
Substrate
Meas. Tech.
Inhibition Assay
Temperature
298.15±n/a K
IC50
5.7±n/a nM
Comments
extracted
Citation
 Püschl, ANielsen, JKehler, JKilburn, JPMarigo, MLanggård, M Heteroaromatic phenylimidazole derivatives as PDE10A enzyme inhibitors US Patent  US9096589 Publication Date 8/4/2015 
Target
Name:
cAMP and cAMP-inhibited cGMP 3',5'-cyclic phosphodiesterase 10A
Synonyms:
3',5'-cyclic phosphodiesterase PDE10_HUMAN Phosphodiesterase 10A
Type:
Protein
Mol. Mass.:
88412.52
Organism:
Homo sapiens (Human)
Description:
Q9Y233
Residue:
779
  
Inhibitor
Name:
BDBM173111
Synonyms:
US9096589, 1-(4-Chloro-phenyl)-2-{2-[2-(5,7-dimethyl-imidazo[1,2-a]pyrimidin-2-yl)-ethyl]-4-thiazol-5-yl-imidazol-1-yl}-ethanol
Type:
Small organic molecule
Emp. Form.:
C24H23ClN6OS
Mol. Mass.:
478.997
SMILES:
Cc1cc(C)n2cc(CCc3nc(cn3CC(O)c3ccc(Cl)cc3)-c3cncs3)nc2n1
: