Target
cAMP and cAMP-inhibited cGMP 3',5'-cyclic phosphodiesterase 10A
Ligand
BDBM173174
Substrate
Meas. Tech.
Inhibition Assay
Temperature
298.15±n/a K
IC50
1.7±n/a nM
Comments
extracted
Citation
 Püschl, ANielsen, JKehler, JKilburn, JPMarigo, MLanggård, M Heteroaromatic phenylimidazole derivatives as PDE10A enzyme inhibitors US Patent  US9096589 Publication Date 8/4/2015 
Target
Name:
cAMP and cAMP-inhibited cGMP 3',5'-cyclic phosphodiesterase 10A
Synonyms:
3',5'-cyclic phosphodiesterase PDE10_HUMAN Phosphodiesterase 10A
Type:
Protein
Mol. Mass.:
88412.52
Organism:
Homo sapiens (Human)
Description:
Q9Y233
Residue:
779
  
Inhibitor
Name:
BDBM173174
Synonyms:
US9096589, 4-{2-[2-(8-Methoxy-5-methyl-[1,2,4]triazolo[1,5-a]pyridin-2-yl)-ethyl]-4-thiophen-2-yl-imidazol-1-yl}-butyronitrile
Type:
Small organic molecule
Emp. Form.:
C21H22N6OS
Mol. Mass.:
406.504
SMILES:
COc1ccc(C)n2nc(CCc3nc(cn3CCCC#N)-c3cccs3)nc12
: