Target
cAMP and cAMP-inhibited cGMP 3',5'-cyclic phosphodiesterase 10A
Ligand
BDBM173175
Substrate
Meas. Tech.
Inhibition Assay
Temperature
298.15±n/a K
IC50
0.33±n/a nM
Comments
extracted
Citation
 Püschl, ANielsen, JKehler, JKilburn, JPMarigo, MLanggård, M Heteroaromatic phenylimidazole derivatives as PDE10A enzyme inhibitors US Patent  US9096589 Publication Date 8/4/2015 
Target
Name:
cAMP and cAMP-inhibited cGMP 3',5'-cyclic phosphodiesterase 10A
Synonyms:
3',5'-cyclic phosphodiesterase PDE10_HUMAN Phosphodiesterase 10A
Type:
Protein
Mol. Mass.:
88412.52
Organism:
Homo sapiens (Human)
Description:
Q9Y233
Residue:
779
  
Inhibitor
Name:
BDBM173175
Synonyms:
US9096589, 8-Methoxy-5-methyl-2-{2-[1-(2-morpholin-4-yl-ethyl)-4-thiophen-2-yl-1H-imidazol-2-yl]-ethyl}-[1,2,4]triazolo[1,5-a]pyridine
Type:
Small organic molecule
Emp. Form.:
C23H28N6O2S
Mol. Mass.:
452.572
SMILES:
COc1ccc(C)n2nc(CCc3nc(cn3CCN3CCOCC3)-c3cccs3)nc12
: