Target
Oligo-1,6-glucosidase IMA1
Ligand
BDBM173536
Substrate
Meas. Tech.
α-Glucosidase Inhibitory Activity
IC50
1.551e+5± 8.27e+3 nM
Citation
 Taha, MIsmail, NHJavaid, KImran, SAnouar, el HWadood, AAtia-Tul-Wahab, nullAli, MKhan, KMSaad, SMRahim, FChoudhary, MI Evaluation of 2-indolcarbohydrazones as potent a-glucosidase inhibitors, in silico studies and DFT based stereochemical predictions. Bioorg Chem 63:24-35 (2015)  
Target
Name:
Oligo-1,6-glucosidase IMA1
Synonyms:
α-glucosidase Alpha-glucosidase (α-glucosidase) MALX3_YEAST | Oligo-1,6-glucosidase
Type:
Protein
Mol. Mass.:
68577.59
Organism:
Saccharomyces cerevisiae S288c (Baker's yeast)
Description:
Residue:
589
  
Inhibitor
Name:
BDBM173536
Synonyms:
(E)-N'-(4-hydroxy-3-methoxybenzylidene)-1H-indole-2-carbohydrazide (8)
Type:
Small organic molecule
Emp. Form.:
C17H15N3O3
Mol. Mass.:
309.3193
SMILES:
COc1cc(\C=N\NC(=O)c2cc3ccccc3[nH]2)ccc1O
: