Target
Oligo-1,6-glucosidase IMA1
Ligand
BDBM173538
Substrate
Meas. Tech.
α-Glucosidase Inhibitory Activity
IC50
4.26e+4± 7.5e+2 nM
Citation
 Taha, MIsmail, NHJavaid, KImran, SAnouar, el HWadood, AAtia-Tul-Wahab, nullAli, MKhan, KMSaad, SMRahim, FChoudhary, MI Evaluation of 2-indolcarbohydrazones as potent a-glucosidase inhibitors, in silico studies and DFT based stereochemical predictions. Bioorg Chem 63:24-35 (2015)  
Target
Name:
Oligo-1,6-glucosidase IMA1
Synonyms:
α-glucosidase Alpha-glucosidase (α-glucosidase) MALX3_YEAST | Oligo-1,6-glucosidase
Type:
Protein
Mol. Mass.:
68577.59
Organism:
Saccharomyces cerevisiae S288c (Baker's yeast)
Description:
Residue:
589
  
Inhibitor
Name:
BDBM173538
Synonyms:
(E)-N'-(2-hydroxybenzylidene)-1H-indole-2-carbohydrazide (10)
Type:
Small organic molecule
Emp. Form.:
C16H13N3O2
Mol. Mass.:
279.2933
SMILES:
Oc1ccccc1\C=N\NC(=O)c1cc2ccccc2[nH]1
: