Target
P2X purinoceptor 7
Ligand
BDBM173682
Substrate
Meas. Tech.
Binding Assay
pH
7.4±n/a
Temperature
298.15±n/a K
IC50
0.54±n/a nM
Comments
extracted
Citation
 Kilburn, JPRasmussen, LKJessing, MEldemenky, EMChen, BJiang, YHopper, AT Benzamides US Patent  US9102591 Publication Date 8/11/2015 
Target
Name:
P2X purinoceptor 7
Synonyms:
ATP receptor P2RX7_HUMAN P2X purinoceptor 7 (P2X7) P2Z receptor | Purinergic receptor
Type:
Protein
Mol. Mass.:
68602.85
Organism:
Homo sapiens (Human)
Description:
Q99572
Residue:
595
  
Inhibitor
Name:
BDBM173682
Synonyms:
US9102591, 2-chloro-N-((4,4-difluoro-1-(6-(trifluoromethyl)pyridin-3-yl)cyclohexyl)methyl)-3-methylbenzamide | US9649308, 2-chloro-N-((4,4-difluoro-1-(6-(trifluoromethyl)pyridin-3-yl)cyclohexyl)methyl)-3-methylbenzamide
Type:
Small organic molecule
Emp. Form.:
C21H20ClF5N2O
Mol. Mass.:
446.841
SMILES:
Cc1cccc(C(=O)NCC2(CCC(F)(F)CC2)c2ccc(nc2)C(F)(F)F)c1Cl
: