Target
P2X purinoceptor 7
Ligand
BDBM173739
Substrate
Meas. Tech.
Binding Assay
pH
7.4±n/a
Temperature
298.15±n/a K
IC50
0.71±n/a nM
Comments
extracted
Citation
 Kilburn, JPRasmussen, LKJessing, MEldemenky, EMChen, BJiang, YHopper, AT Benzamides US Patent  US9102591 Publication Date 8/11/2015 
Target
Name:
P2X purinoceptor 7
Synonyms:
ATP receptor P2RX7_HUMAN P2X purinoceptor 7 (P2X7) P2Z receptor | Purinergic receptor
Type:
Protein
Mol. Mass.:
68602.85
Organism:
Homo sapiens (Human)
Description:
Q99572
Residue:
595
  
Inhibitor
Name:
BDBM173739
Synonyms:
US9102591, (+)2,6-dichloro-N-[3-cyclopropyl-2-[6-(trifluoromethyl)-3-pyridyl]propyl]benzamide US9102591, 2,6-dichloro-N-(3-cyclopropyl-2-(6-(trifluoromethyl)pyridin-3-yl)propyl)benzamide | US9649308, (+)2,6-dichloro-N-[3-cyclopropyl-2-[6-(trifluoromethyl)-3-pyridyl]propyl]benzamide
Type:
Small organic molecule
Emp. Form.:
C19H17Cl2F3N2O
Mol. Mass.:
417.252
SMILES:
FC(F)(F)c1ccc(cn1)C(CNC(=O)c1c(Cl)cccc1Cl)CC1CC1
: