Target
Serine/threonine-protein kinase mTOR
Ligand
BDBM174293
Substrate
Meas. Tech.
Alternative Enzyme Assay
Temperature
298.15±n/a K
IC50
2.1±n/a nM
Comments
extracted
Citation
 Duggan, HMLeroux, FGMalagu, KFMartin, NMMenear, KSmith, GC Pyrido-, pyrazo- and pyrimido-pyrimidine derivatives as mTOR inhibitors US Patent  US9102670 Publication Date 8/11/2015 
Target
Name:
Serine/threonine-protein kinase mTOR
Synonyms:
FK506-binding protein 12-rapamycin complex-associated protein 1 FRAP FRAP1 MTOR Mammalian Target of Rapamycin (mTOR) RAFT1 Rapamycin and FKBP12 target 1 Serine/threonine-protein kinase (mTOR) | mTORC2
Type:
Rapamycin target protein
Mol. Mass.:
288917.12
Organism:
Homo sapiens (Human)
Description:
P42345
Residue:
2549
  
Inhibitor
Name:
BDBM174293
Synonyms:
US9102670, 1h
Type:
Small organic molecule
Emp. Form.:
C23H27N5O3
Mol. Mass.:
421.4922
SMILES:
C[C@H]1COCCN1c1nc(N2CCOC[C@@H]2C)c2ccc(nc2n1)-c1cccc(O)c1
: