Target
Serine/threonine-protein kinase mTOR
Ligand
BDBM174424
Substrate
Meas. Tech.
Alternative Enzyme Assay
Temperature
298.15±n/a K
IC50
4.8±n/a nM
Comments
extracted
Citation
 Duggan, HMLeroux, FGMalagu, KFMartin, NMMenear, KSmith, GC Pyrido-, pyrazo- and pyrimido-pyrimidine derivatives as mTOR inhibitors US Patent  US9102670 Publication Date 8/11/2015 
Target
Name:
Serine/threonine-protein kinase mTOR
Synonyms:
FK506-binding protein 12-rapamycin complex-associated protein 1 FRAP FRAP1 MTOR Mammalian Target of Rapamycin (mTOR) RAFT1 Rapamycin and FKBP12 target 1 Serine/threonine-protein kinase (mTOR) | mTORC2
Type:
Rapamycin target protein
Mol. Mass.:
288917.12
Organism:
Homo sapiens (Human)
Description:
P42345
Residue:
2549
  
Inhibitor
Name:
BDBM174424
Synonyms:
US9102670, 1ee
Type:
Small organic molecule
Emp. Form.:
C23H28N6O4S
Mol. Mass.:
484.571
SMILES:
C[C@H]1COCCN1c1nc(nc2nc(ccc12)-c1cccc(NS(C)(=O)=O)c1)N1CCOCC1
: