Target
Egl nine homolog 1
Ligand
BDBM50431015
Substrate
Meas. Tech.
HIF-PH Assay
pH
7.4±n/a
IC50
2.1e+3±n/a nM
Comments
extracted
Citation
 Witschi, CPark, JMThompson, MDMartinelli, MJYeowell, DAArend, MP Crystalline forms of a prolyl hydroxylase inhibitor US Patent  US9115085 Publication Date 8/25/2015 
Target
Name:
Egl nine homolog 1
Synonyms:
C1orf12 EGLN1_HUMAN Hypoxia-inducible factor prolyl hydroxylase 2 (HIF-PH2) Prolyl hydroxylase domain-containing protein 2 (PHD2)
Type:
Protein
Mol. Mass.:
46035.59
Organism:
Homo sapiens (Human)
Description:
Q9GZT9
Residue:
426
  
Inhibitor
Name:
BDBM50431015
Synonyms:
CHEMBL2338329 US9115085, Compound A Form A | US9340511, 3
Type:
Small organic molecule
Emp. Form.:
C19H16N2O5
Mol. Mass.:
352.3407
SMILES:
Cc1nc(C(=O)NCC(O)=O)c(O)c2ccc(Oc3ccccc3)cc12
: