Target
Protein Nef
Ligand
BDBM288025
Substrate
Meas. Tech.
Measurement of Antiviral (HIV-1) Activity
Temperature
298.15±n/a K
EC50
5.00±n/a nM
Comments
extracted
Citation
 Miyazaki, SIsoshima, HOshita, KKawashita, SNagahashi, NTerashita, M Substituted spiropyrido[1,2-a]pyrazine derivative and medicinal use thereof as HIV integrase inhibitor US Patent  US10087178 Publication Date 10/2/2018 
Target
Name:
Protein Nef
Synonyms:
3ORF HIV-1 Nef Negative factor nef
Type:
C-terminal core protein
Mol. Mass.:
23340.47
Organism:
Human immunodeficiency virus type 1 (isolate BRU/LAI group M subtype B)
Description:
P03406
Residue:
206
  
Inhibitor
Name:
BDBM288025
Synonyms:
US10087178, Example 7
Type:
Small organic molecule
Emp. Form.:
C23H25ClFN3O6
Mol. Mass.:
493.913
SMILES:
COC[C@H]1C[C@]2(C1)CN(C)C(=O)c1c(O)c(=O)c(cn21)C(=O)NCc1ccc(OC)c(Cl)c1F
: