Target
Protein Nef
Ligand
BDBM288037
Substrate
Meas. Tech.
Measurement of Antiviral (HIV-1) Activity
Temperature
298.15±n/a K
EC50
2.60±n/a nM
Comments
extracted
Citation
 Miyazaki, SIsoshima, HOshita, KKawashita, SNagahashi, NTerashita, M Substituted spiropyrido[1,2-a]pyrazine derivative and medicinal use thereof as HIV integrase inhibitor US Patent  US10087178 Publication Date 10/2/2018 
Target
Name:
Protein Nef
Synonyms:
3ORF HIV-1 Nef Negative factor nef
Type:
C-terminal core protein
Mol. Mass.:
23340.47
Organism:
Human immunodeficiency virus type 1 (isolate BRU/LAI group M subtype B)
Description:
P03406
Residue:
206
  
Inhibitor
Name:
BDBM288037
Synonyms:
US10087178, Example 18
Type:
Small organic molecule
Emp. Form.:
C22H23ClFN3O5
Mol. Mass.:
463.887
SMILES:
CCN1C(=O)c2c(O)c(=O)c(cn2C[C@]11C[C@H]1COC)C(=O)NCc1cccc(Cl)c1F
: