Target
Urease
Ligand
BDBM175352
Substrate
Meas. Tech.
Urease Inhibition Assay
Ki
1.576e+4± 1e+1 nM
IC50
3.56e+4± 7e+2 nM
Citation
 Khan, AHashim, JArshad, NKhan, ISiddiqui, NWadood, AAli, MArshad, FKhan, KMChoudhary, MI Dihydropyrimidine based hydrazine dihydrochloride derivatives as potent urease inhibitors. Bioorg Chem 64:85-96 (2016)  
Target
Name:
Urease
Synonyms:
UREA_CANEN | Urea amidohydrolase
Type:
Enzyme
Mol. Mass.:
90746.20
Organism:
Canavalia ensiformis (Jack bean) (Horse bean)
Description:
P07374
Residue:
840
  
Inhibitor
Name:
BDBM175352
Synonyms:
Ethyl 6-methyl-4-phenyl-2-thioxo-1,2,3,4-tetrahydropyrimidine-5-carboxylate (7)
Type:
Small organic molecule
Emp. Form.:
C14H16N2O2S
Mol. Mass.:
276.354
SMILES:
CCOC(=O)C1=C(C)NC(=S)NC1c1ccccc1
: