Target
Adenosine receptor A2b
Ligand
BDBM175383
Substrate
Meas. Tech.
Radioligand Binding Assay
Ki
8.21e+3±n/a nM
Citation
 Yadav, RBansal, RRohilla, SKachler, SKlotz, KN Synthesis and pharmacological characterization of novel xanthine carboxylate amides as A2A adenosine receptor ligands exhibiting bronchospasmolytic activity. Bioorg Chem 65:26-37 (2016)  
Target
Name:
Adenosine receptor A2b
Synonyms:
AA2BR_HUMAN ADORA2B Adenosine receptors A2b | Adenosine receptors; A2a & A2b
Type:
G Protein-Coupled Receptor (GPCR)
Mol. Mass.:
36341.22
Organism:
Homo sapiens (Human)
Description:
Residue:
332
  
Inhibitor
Name:
BDBM175383
Synonyms:
1,3-Dimethyl-8-[3-{2-(1-methylpiperazin-4-yl)-2-oxoethoxy}-phenyl]xanthine (14g, RB-380)
Type:
Small organic molecule
Emp. Form.:
C20H24N6O4
Mol. Mass.:
412.4424
SMILES:
CN1CCN(CC1)C(=O)COc1cccc(c1)-c1nc2n(C)c(=O)n(C)c(=O)c2[nH]1
: