Target
Adenosine receptor A3 [I248L]
Ligand
BDBM175385
Substrate
Meas. Tech.
Radioligand Binding Assay
Ki
9.25e+3±n/a nM
Citation
 Yadav, RBansal, RRohilla, SKachler, SKlotz, KN Synthesis and pharmacological characterization of novel xanthine carboxylate amides as A2A adenosine receptor ligands exhibiting bronchospasmolytic activity. Bioorg Chem 65:26-37 (2016)  
Target
Name:
Adenosine receptor A3 [I248L]
Synonyms:
AA3R_HUMAN Adenosine receptor A3 | Adenosine receptor A3 (A3)
Type:
Protein
Mol. Mass.:
36197.32
Organism:
Homo sapiens (Human)
Description:
P0DMS8[I248L]
Residue:
318
  
Inhibitor
Name:
BDBM175385
Synonyms:
1,3-Dimethyl-8-[3-{2-(homoveratrylamino)-2-oxoethoxy}-phenyl]xanthine (14i, RB-377)
Type:
Small organic molecule
Emp. Form.:
C25H27N5O6
Mol. Mass.:
493.5118
SMILES:
COc1ccc(CCNC(=O)COc2cccc(c2)-c2nc3n(C)c(=O)n(C)c(=O)c3[nH]2)cc1OC
: