Target
Adenosine receptor A1
Ligand
BDBM50310923
Substrate
Meas. Tech.
Fluorometric Imaging Plate Reader (FLIPR) Asssay
IC50
57.6±n/a nM
Citation
 Jordan, ABedford, SBurkhard, KYule, IPoullennec, K Thienopyrimidine compounds US Patent  US9120807 Publication Date 9/1/2015 
Target
Name:
Adenosine receptor A1
Synonyms:
A1 adenosine receptor (hA1) AA1R_HUMAN ADORA1 Adenosine A1-receptor Adenosine receptor A1 (hA1) | Adenosine transporter (AdT)
Type:
G Protein-Coupled Receptor (GPCR)
Mol. Mass.:
36520.92
Organism:
Homo sapiens (Human)
Description:
P30542
Residue:
326
  
Inhibitor
Name:
BDBM50310923
Synonyms:
CHEMBL1077943 {6-Methylamino-2-[(pyridin-3-ylmethyl)-amino]-thieno[3,2-d]pyrimidin-4-yl}-thiophen-2-yl-methanone
Type:
Small organic molecule
Emp. Form.:
C18H15N5OS2
Mol. Mass.:
381.475
SMILES:
CNc1cc2nc(NCc3cccnc3)nc(C(=O)c3cccs3)c2s1
: