Target
Adenosine receptor A2a
Ligand
BDBM50310924
Substrate
Meas. Tech.
Fluorometric Imaging Plate Reader (FLIPR) Asssay
IC50
726.3±n/a nM
Citation
 Jordan, ABedford, SBurkhard, KYule, IPoullennec, K Thienopyrimidine compounds US Patent  US9120807 Publication Date 9/1/2015 
Target
Name:
Adenosine receptor A2a
Synonyms:
A2A adenosine receptor (hA2A) ADENOSINE A2 ADORA2 Adenosine A2A receptor (A2AAR)
Type:
G Protein-Coupled Receptor (GPCR)
Mol. Mass.:
44716.46
Organism:
Homo sapiens (Human)
Description:
P29274
Residue:
412
  
Inhibitor
Name:
BDBM50310924
Synonyms:
CHEMBL1080421 {6-Ethylamino-2-[(pyridin-3-ylmethyl)-amino]-thieno[3,2-d]pyrimidin-4-yl}-thiophen-2-yl-methanone
Type:
Small organic molecule
Emp. Form.:
C19H17N5OS2
Mol. Mass.:
395.501
SMILES:
CCNc1cc2nc(NCc3cccnc3)nc(C(=O)c3cccs3)c2s1
: