Target
Oligo-1,6-glucosidase IMA1
Ligand
BDBM23406
Substrate
Meas. Tech.
alpha-Glucosidase Inhibition Assay
pH
6.8±n/a
IC50
3.825e+4± 1.2e+2 nM
Comments
extracted
Citation
 Imran, STaha, MIsmail, NHKashif, SMRahim, FJamil, WWahab, HKhan, KM Synthesis, In vitro and Docking Studies of New Flavone Ethers as a-Glucosidase Inhibitors. Chem Biol Drug Des 87:361-73 (2016)  
Target
Name:
Oligo-1,6-glucosidase IMA1
Synonyms:
α-glucosidase Alpha-glucosidase (α-glucosidase) MALX3_YEAST | Oligo-1,6-glucosidase
Type:
Protein
Mol. Mass.:
68577.59
Organism:
Saccharomyces cerevisiae S288c (Baker's yeast)
Description:
Residue:
589
  
Inhibitor
Name:
BDBM23406
Synonyms:
(3R,4R,5S,6R)-5-{[(2R,3R,4R,5S,6R)-5-{[(2R,3R,4S,5S,6R)-3,4-dihydroxy-6-methyl-5-{[(1S,4R,5S,6S)-4,5,6-trihydroxy-3-(hydroxymethyl)cyclohex-2-en-1-yl]amino}oxan-2-yl]oxy}-3,4-dihydroxy-6-(hydroxymethyl)oxan-2-yl]oxy}-6-(hydroxymethyl)oxane-2,3,4-triol US11292789, Acarbose
Type:
Carbohydrate
Emp. Form.:
C25H43NO18
Mol. Mass.:
645.6048
SMILES:
C[C@H]1O[C@H](O[C@@H]2[C@@H](CO)O[C@H](O[C@@H]3[C@@H](CO)OC(O)[C@H](O)[C@H]3O)[C@H](O)[C@H]2O)[C@H](O)[C@@H](O)[C@@H]1N[C@H]1C=C(CO)[C@@H](O)[C@H](O)[C@H]1O
: