Target
Aquaporin-1
Ligand
BDBM178093
Substrate
Meas. Tech.
Stopped-flow Assay
IC50
1.52e+4± 1.1e+3 nM
Citation
 Patil, RVXu, Svan Hoek, ANRusinko, AFeng, ZMay, JHellberg, MSharif, NAWax, MBIrigoyen, MCarr, GBrittain, TBrown, PColbert, DKumari, SVaradaraj, KMitra, AK Rapid Identification of Novel Inhibitors of the Human Aquaporin-1 Water Channel. Chem Biol Drug Des 87:794-805 (2016)  
Target
Name:
Aquaporin-1
Synonyms:
AQP1 Aquaporin-1 (AQP1) | CHIP28
Type:
Protein
Mol. Mass.:
28528.18
Organism:
Homo sapiens (Human)
Description:
Residue:
269
  
Inhibitor
Name:
BDBM178093
Synonyms:
[7-(2,4-dichlorophenyl)-5-fluoro-2,3-dihydro-1-benzofuran-2-yl]methanamine (Compound 5)
Type:
Small organic molecule
Emp. Form.:
C15H12Cl2FNO
Mol. Mass.:
312.166
SMILES:
NCC1Cc2cc(F)cc(c2O1)-c1ccc(Cl)cc1Cl
: