Target
Histone deacetylase 2
Ligand
BDBM19149
Substrate
Meas. Tech.
In-vitro HDAC Enzymatic Endpoint Assay
pH
7.4±n/a
Temperature
298.15±n/a K
IC50
11± 0.5 nM
Comments
extracted
Citation
 Wagner, FFLundh, MKaya, TMcCarren, PZhang, YLChattopadhyay, SGale, JPGalbo, TFisher, SLMeier, BCVetere, ARichardson, SMorgan, NGChristensen, DPGilbert, TJHooker, JMLeroy, MWalpita, DMandrup-Poulsen, TWagner, BKHolson, EB An Isochemogenic Set of Inhibitors To Define the Therapeutic Potential of Histone Deacetylases in ß-Cell Protection. ACS Chem Biol 11:363-74 (2016)  
Target
Name:
Histone deacetylase 2
Synonyms:
Cereblon/Histone deacetylase 2 HDAC2 Histone deacetylase 2 (HDAC2) | Human HDAC2
Type:
Chromatin regulator; hydrolase; repressor
Mol. Mass.:
55356.54
Organism:
Homo sapiens (Human)
Description:
Q92769
Residue:
488
  
Inhibitor
Name:
BDBM19149
Synonyms:
CHEMBL98 SAHA US10188756, Compound SAHA US11505523, Compound SAHA US9353061, SAHA US9695181, Vorinostat Zolinza suberoylanilide hydroxamic acid
Type:
Small organic molecule
Emp. Form.:
C14H20N2O3
Mol. Mass.:
264.3202
SMILES:
ONC(=O)CCCCCCC(=O)Nc1ccccc1
: