Target
Histone deacetylase 5
Ligand
BDBM19422
Substrate
Meas. Tech.
In-vitro HDAC Enzymatic Endpoint Assay
pH
7.4±n/a
Temperature
298.15±n/a K
IC50
>3.33e+4±n/a nM
Comments
extracted
Citation
 Wagner, FFLundh, MKaya, TMcCarren, PZhang, YLChattopadhyay, SGale, JPGalbo, TFisher, SLMeier, BCVetere, ARichardson, SMorgan, NGChristensen, DPGilbert, TJHooker, JMLeroy, MWalpita, DMandrup-Poulsen, TWagner, BKHolson, EB An Isochemogenic Set of Inhibitors To Define the Therapeutic Potential of Histone Deacetylases in ß-Cell Protection. ACS Chem Biol 11:363-74 (2016)  
Target
Name:
Histone deacetylase 5
Synonyms:
Antigen NY-CO-9 HDAC5 Histone acetylase 5 (HDAC5) Human HDAC5 | KIAA0600
Type:
Enzyme
Mol. Mass.:
121968.61
Organism:
Homo sapiens (Human)
Description:
Q9UQL6
Residue:
1122
  
Inhibitor
Name:
BDBM19422
Synonyms:
4-(acetylamino)-N-(2-amino-phenyl) benzamide N-(2-aminophenyl)-4-acetamidobenzamide US11207431, Example F | US11377423, CI-994
Type:
Small organic molecule
Emp. Form.:
C15H15N3O2
Mol. Mass.:
269.2985
SMILES:
CC(=O)Nc1ccc(cc1)C(=O)Nc1ccccc1N
: