Target
Histone deacetylase 7
Ligand
BDBM178095
Substrate
Meas. Tech.
In-vitro HDAC Enzymatic Endpoint Assay
pH
7.4±n/a
Temperature
298.15±n/a K
IC50
>3.33e+4±n/a nM
Comments
extracted
Citation
 Wagner, FFLundh, MKaya, TMcCarren, PZhang, YLChattopadhyay, SGale, JPGalbo, TFisher, SLMeier, BCVetere, ARichardson, SMorgan, NGChristensen, DPGilbert, TJHooker, JMLeroy, MWalpita, DMandrup-Poulsen, TWagner, BKHolson, EB An Isochemogenic Set of Inhibitors To Define the Therapeutic Potential of Histone Deacetylases in ß-Cell Protection. ACS Chem Biol 11:363-74 (2016)  
Target
Name:
Histone deacetylase 7
Synonyms:
HD7 HDAC7A Histone acetylase 7 (HDAC7) Human HDAC7
Type:
Chromatin regulator; hydrolase; repressor
Mol. Mass.:
102942.62
Organism:
Homo sapiens (Human)
Description:
Q8WUI4
Residue:
952
  
Inhibitor
Name:
BDBM178095
Synonyms:
BRD2492
Type:
Small organic molecule
Emp. Form.:
C20H18N4O2
Mol. Mass.:
346.3825
SMILES:
CC(=O)Nc1ccc(cc1)C(=O)Nc1cc(ccc1N)-c1ccncc1
: