Target
Apoptosis regulator Bcl-2
Ligand
BDBM178562
Substrate
Meas. Tech.
Time Resolved-Fluorescence Resonance Energy Transfer (TR-FRET) Assay
Ki
0.001±n/a nM
Citation
 Bruncko, MDing, HDoherty, GAElmore, SWHasvold, LHexamer, LAKunzer, ARMantei, RAMcClellan, WJPark, CHPark, CPetros, AMSong, XSouers, AJSullivan, GMTao, ZWang, GTWang, LWang, XWendt, MD Bcl-2-selective apoptosis-inducing agents for the treatment of cancer and immune diseases US Patent  US9125913 Publication Date 9/8/2015 
Target
Name:
Apoptosis regulator Bcl-2
Synonyms:
BCL2_MOUSE Bcl2
Type:
Protein
Mol. Mass.:
26409.44
Organism:
Mus musculus (Mouse)
Description:
P10417
Residue:
236
  
Inhibitor
Name:
BDBM178562
Synonyms:
US9125913, 121
Type:
Small organic molecule
Emp. Form.:
C47H54ClN7O7S
Mol. Mass.:
896.492
SMILES:
CN(C)CCOc1ccc(c(CN2CCN(CC2)c2ccc(C(=O)NS(=O)(=O)c3ccc(NCCCN4CCCC4)c(c3)[N+]([O-])=O)c(Oc3ccccc3)c2)c1)-c1ccc(Cl)cc1
: