Target
Bcl-2-like protein 1
Ligand
BDBM178842
Substrate
Meas. Tech.
Time Resolved-Fluorescence Resonance Energy Transfer (TR-FRET) Assay
Ki
95.64±n/a nM
Citation
 Bruncko, MDing, HDoherty, GAElmore, SWHasvold, LHexamer, LAKunzer, ARMantei, RAMcClellan, WJPark, CHPark, CPetros, AMSong, XSouers, AJSullivan, GMTao, ZWang, GTWang, LWang, XWendt, MD Bcl-2-selective apoptosis-inducing agents for the treatment of cancer and immune diseases US Patent  US9125913 Publication Date 9/8/2015 
Target
Name:
Bcl-2-like protein 1
Synonyms:
Apoptosis regulator Bcl-XL Bcl2l Bclx
Type:
Protein
Mol. Mass.:
26122.63
Organism:
Mus musculus (Mouse)
Description:
Q64373
Residue:
233
  
Inhibitor
Name:
BDBM178842
Synonyms:
US9125913, 414
Type:
Small organic molecule
Emp. Form.:
C46H52Cl2N6O6S
Mol. Mass.:
887.913
SMILES:
COC1CCC(COc2ncc(cc2Cl)S(=O)(=O)NC(=O)c2ccc(cc2Oc2cccc3[nH]ncc23)N2CCN(CC3=C(CC(C)(C)CC3)c3ccc(Cl)cc3)CC2)CC1
: