Target
ALK tyrosine kinase receptor
Ligand
BDBM179002
Substrate
Meas. Tech.
Inhibition Assay
IC50
0.391±n/a nM
Citation
 Kinoshita, KAsoh, KFuruichi, NIto, TKawada, HIshii, NSakamoto, HHong, WPark, MOno, YKato, YMorikami, KEmura, TOikawa, N Tetracyclic compound US Patent  US9126931 Publication Date 9/8/2015 
Target
Name:
ALK tyrosine kinase receptor
Synonyms:
ALK ALK_HUMAN CD_antigen: CD246
Type:
Protein
Mol. Mass.:
176453.10
Organism:
Homo sapiens (Human)
Description:
Q9UM73
Residue:
1620
  
Inhibitor
Name:
BDBM179002
Synonyms:
US9126931, 403
Type:
Small organic molecule
Emp. Form.:
C28H29ClN4O2
Mol. Mass.:
489.008
SMILES:
CC1(C)c2[nH]c3cc(ccc3c2C(=O)c2cc(Cl)c(cc12)N1CCC(CC1)N1CCOCC1)C#N
: