Target
Potassium channel subfamily K member 3
Ligand
BDBM179659
Substrate
Meas. Tech.
Biological Assay
Temperature
298.15±n/a K
IC50
114±n/a nM
Comments
extracted
Citation
 Bialy, LLorenz, KWirth, KSteinmeyer, KHessler, GPernerstorfer, JBrendel, J Substituted 4,5,6,7-tetrahydro-1H-pyrazolo[4,3-c]pyridines, their use as medicament, and pharmaceutical preparations comprising them US Patent  US9127001 Publication Date 9/8/2015 
Target
Name:
Potassium channel subfamily K member 3
Synonyms:
Acid-sensitive potassium channel TASK-1 KCNK3 Potassium channel protein TASK-1 Potassium channel subfamily K member 3 (TASK-1) TASK1 Two pore K(+) channel KT3.1 | Two pore potassium channel KT3.1
Type:
Protein
Mol. Mass.:
43534.71
Organism:
Homo sapiens (Human)
Description:
O14649
Residue:
394
  
Inhibitor
Name:
BDBM179659
Synonyms:
US9127001, 6am | US9598410, Compound 6am
Type:
Small organic molecule
Emp. Form.:
C23H19F3N4O
Mol. Mass.:
424.4184
SMILES:
CC(=O)N1CCc2c(C1)c(nn2Cc1ccc(cc1)C#N)-c1cccc(c1)C(F)(F)F
: