Target
ALK tyrosine kinase receptor [C1156Y]
Ligand
BDBM179800
Substrate
Meas. Tech.
ALK HTRF Assays
pH
7.5±n/a
Temperature
298.15±n/a K
IC50
1310±0.0 nM
Comments
extracted
Citation
 Liu, NWang, YHuang, GJi, CFan, WLi, HCheng, YTian, H Design, synthesis and biological evaluation of 1H-pyrrolo[2,3-b]pyridine and 1H-pyrazolo[3,4-b]pyridine derivatives as c-Met inhibitors. Bioorg Chem 65:146-58 (2016)  
Target
Name:
ALK tyrosine kinase receptor [C1156Y]
Synonyms:
ALK Anaplastic lymphoma kinase C1156Y (ALK C1156Y)
Type:
Mol. Mass.:
176513.13
Organism:
Homo sapiens (Human)
Description:
Q9UM73[C1156Y]
Residue:
1620
  
Inhibitor
Name:
BDBM179800
Synonyms:
3-((2,6-dichloro-3-fluorophenyl)sulfide)-5-(1-(piperidin-4-yl)-1H-pyrazol-4-yl)-1Hpyrrolo[2,3-b]pyridine (8)
Type:
Small organic molecule
Emp. Form.:
C21H18Cl2FN5OS
Mol. Mass.:
478.37
SMILES:
Fc1ccc(Cl)c(c1Cl)S(=O)c1c[nH]c2ncc(cc12)-c1cnn(c1)C1CCNCC1
: