Target
Mu-type opioid receptor
Ligand
BDBM179876
Substrate
Meas. Tech.
pH
7.5±n/a
Temperature
298.15±n/a K
Ki
0.22±n/a nM
IC50
14±n/a nM
Comments
extracted
Citation
 Blumberg, LCDeaver, DEyerman, D Morphan and morphinan analogues, and methods of use US Patent  US9133125 Publication Date 9/15/2015 
Target
Name:
Mu-type opioid receptor
Synonyms:
M-OR-1 MOR-1 MUOR1 Mu opiate receptor OPRM1 hMOP | mu-type opioid receptor isoform MOR-1
Type:
G Protein-Coupled Receptor (GPCR)
Mol. Mass.:
44789.51
Organism:
Homo sapiens (Human)
Description:
P35372
Residue:
400
  
Inhibitor
Name:
BDBM179876
Synonyms:
US10231963, Table B.22 US10736890, Compound TABLE B.22 US11534436, Compound Table B.22 US9656961, Example 00139
Type:
Small organic molecule
Emp. Form.:
C22H30N2O3
Mol. Mass.:
370.4852
SMILES:
NC(=O)c1ccc2C[C@@H]3[C@@H]4CC[C@H](O)C[C@]4(CCN3CC3CCC3)c2c1O
: