Target
Mu-type opioid receptor
Ligand
BDBM179898
Substrate
Meas. Tech.
pH
7.5±n/a
Temperature
298.15±n/a K
Ki
0.14±n/a nM
IC50
0.65±n/a nM
Comments
extracted
Citation
 Blumberg, LCDeaver, DEyerman, D Morphan and morphinan analogues, and methods of use US Patent  US9133125 Publication Date 9/15/2015 
Target
Name:
Mu-type opioid receptor
Synonyms:
M-OR-1 MOR-1 MUOR1 Mu opiate receptor OPRM1 hMOP | mu-type opioid receptor isoform MOR-1
Type:
G Protein-Coupled Receptor (GPCR)
Mol. Mass.:
44789.51
Organism:
Homo sapiens (Human)
Description:
P35372
Residue:
400
  
Inhibitor
Name:
BDBM179898
Synonyms:
US10231963, Table C.2 US10736890, Compound TABLE C.2 US11534436, Compound Table C.2 US9656961, Example 00166
Type:
Small organic molecule
Emp. Form.:
C22H28N2O4
Mol. Mass.:
384.4687
SMILES:
C[C@@H](C1CC1)N1CC[C@]23CC(=O)CC[C@@]2(O)[C@H]1Cc1ccc(C(N)=O)c(O)c31
: