Target
Tyrosine-protein kinase receptor UFO
Ligand
BDBM180270
Substrate
Meas. Tech.
Kinase Assay
pH
7±n/a
Temperature
298.15±n/a K
IC50
11±n/a nM
Comments
extracted
Citation
 Xi, N Substituted quinoline compounds and methods of use US Patent  US9133162 Publication Date 9/15/2015 
Target
Name:
Tyrosine-protein kinase receptor UFO
Synonyms:
AXL TEL/AXL UFO | UFO_HUMAN
Type:
Enzyme
Mol. Mass.:
98316.97
Organism:
Homo sapiens (Human)
Description:
P30530
Residue:
894
  
Inhibitor
Name:
BDBM180270
Synonyms:
US9133162, Example 1
Type:
Small organic molecule
Emp. Form.:
C31H29FN4O5
Mol. Mass.:
556.5842
SMILES:
Cc1c(C(=O)Nc2ccc(Oc3ccnc4cc(OCC(C)(C)O)ccc34)c(F)c2)c(=O)n(-c2ccccc2)n1C
: