Target
cAMP-specific 3',5'-cyclic phosphodiesterase 4B
Ligand
BDBM180795
Substrate
Meas. Tech.
Scintillation Proximity Assay (SPA)
pH
7.4±n/a
Temperature
310.15±n/a K
IC50
5.75±n/a nM
Comments
extracted
Citation
 Schmidt, BScheufler, CVolz, JFeth, MHummel, RHatzelmann, AZitt, CWohlsen, AMarx, DKley, HOckert, DHeuser, AChristiaans, JASterk, GJMenge, WM Pyrazolone derivatives as PDE4 inhibitors US Patent  US8865745 Publication Date 10/21/2014 
Target
Name:
cAMP-specific 3',5'-cyclic phosphodiesterase 4B
Synonyms:
3',5'-cyclic phosphodiesterase Isoform PDE4B1 PDE4B PDE4B_HUMAN Phosphodiesterase 4B (PDE4B) Phosphodiesterase Type 4 (PDE4B)
Type:
Protein
Mol. Mass.:
83318.87
Organism:
Homo sapiens (Human)
Description:
Q07343
Residue:
736
  
Inhibitor
Name:
BDBM180795
Synonyms:
US8865745, 20
Type:
Small organic molecule
Emp. Form.:
C28H32N4O5
Mol. Mass.:
504.5775
SMILES:
COc1ccc(cc1OC)C1=NN(C2CCN(CC2)C(=O)CN2C(=O)Cc3ccccc23)C(=O)C1(C)C
: