Target
Dual specificity protein kinase CLK3
Ligand
BDBM181052
Substrate
Meas. Tech.
Kinase Inhibition Assay
IC50
>3000±0.0 nM
Citation
 Prak, KKriston-Vizi, JChan, AWLuft, CCosta, JRPengo, NKetteler, R Benzobisthiazoles Represent a Novel Scaffold for Kinase Inhibitors of CLK Family Members. Biochemistry 55:608-17 (2016)  
Target
Name:
Dual specificity protein kinase CLK3
Synonyms:
CDC2-like kinase 3 (CLK3) CLK3_HUMAN | Dual specificity protein kinase CLK3
Type:
Protein
Mol. Mass.:
73570.11
Organism:
Homo sapiens (Human)
Description:
Residue:
638
  
Inhibitor
Name:
BDBM181052
Synonyms:
5F4
Type:
Small organic molecule
Emp. Form.:
C20H18N4O4S4
Mol. Mass.:
506.641
SMILES:
CSc1nc2ccc3nc(NC(=O)c4ccc(cc4)S(=O)(=O)N4CCOCC4)sc3c2s1
: