Target
Alpha-glucosidase MAL12
Ligand
BDBM181059
Substrate
Meas. Tech.
In vitro Assay of alpha-Glucosidasee Inhibitory Activity
pH
6.8±n/a
IC50
3.718e+4± 6.1e+2 nM
Comments
extracted
Citation
 Wang, GHe, DLi, XLi, JPeng, Z Design, synthesis and biological evaluation of novel coumarin thiazole derivatives as a-glucosidase inhibitors. Bioorg Chem 65:167-74 (2016)  
Target
Name:
Alpha-glucosidase MAL12
Synonyms:
α-Glucosidase MAL12_YEAST Maltase | alpha-Glucosidase (α-Glucosidase)
Type:
Protein
Mol. Mass.:
68084.32
Organism:
Saccharomyces cerevisiae
Description:
P53341
Residue:
584
  
Inhibitor
Name:
BDBM181059
Synonyms:
(E)-N'-(2-Hydroxybenzylidene)-4-(2-oxo-2H-chromen-3-yl)thiazole-2-carbohydrazide (7b)
Type:
Small organic molecule
Emp. Form.:
C20H13N3O4S
Mol. Mass.:
391.4
SMILES:
Oc1ccccc1\C=N\NC(=O)c1nc(cs1)-c1cc2ccccc2oc1=O
: