Target
Alpha-glucosidase MAL12
Ligand
BDBM181066
Substrate
Meas. Tech.
In vitro Assay of alpha-Glucosidasee Inhibitory Activity
pH
6.8±n/a
IC50
3.862e+4± 3.5e+2 nM
Comments
extracted
Citation
 Wang, GHe, DLi, XLi, JPeng, Z Design, synthesis and biological evaluation of novel coumarin thiazole derivatives as a-glucosidase inhibitors. Bioorg Chem 65:167-74 (2016)  
Target
Name:
Alpha-glucosidase MAL12
Synonyms:
α-Glucosidase MAL12_YEAST Maltase | alpha-Glucosidase (α-Glucosidase)
Type:
Protein
Mol. Mass.:
68084.32
Organism:
Saccharomyces cerevisiae
Description:
P53341
Residue:
584
  
Inhibitor
Name:
BDBM181066
Synonyms:
(E)-N'-(2,4-Dihydroxybenzylidene)-4-(2-oxo-2H-chromen-3-yl)thiazole-2-carbohydrazide (7j)
Type:
Small organic molecule
Emp. Form.:
C20H13N3O5S
Mol. Mass.:
407.399
SMILES:
Oc1ccc(\C=N\NC(=O)c2nc(cs2)-c2cc3ccccc3oc2=O)c(O)c1
: