Target
ATP-sensitive inward rectifier potassium channel 1
Ligand
BDBM181746
Substrate
Meas. Tech.
Electrophysiology Assay
pH
7.4±n/a
Temperature
310.15±n/a K
IC50
55±n/a nM
Comments
extracted
Citation
 Walsh, SPPasternak, ADeJesus, RKTang, HPio, BShahripour, ABelyk, KMChobanian, HRGuo, YFrie, JLShi, ZChen, HBlizzard, TACato, B Inhibitors of the Renal Outer Medullary Potassium channel US Patent  US9139585 Publication Date 9/22/2015 
Target
Name:
ATP-sensitive inward rectifier potassium channel 1
Synonyms:
ATP-regulated potassium channel ROM-K ATP-sensitive inward rectifier potassium channel 1 KCNJ1 Potassium channel (ATP modulatory) ROMK1 The Renal Outer Medullary Potassium (ROMK)
Type:
Enzyme Catalytic Domain
Mol. Mass.:
44809.08
Organism:
Homo sapiens (Human)
Description:
gi_223460826
Residue:
391
  
Inhibitor
Name:
BDBM181746
Synonyms:
US9139585, 36A
Type:
Small organic molecule
Emp. Form.:
C24H29N7O4
Mol. Mass.:
479.5316
SMILES:
Cc1nc(ccc1[C@@H](O)CN1CCN(C[C@H](O)c2ccc3C(=O)OCc3c2C)CC1)-n1cnnn1
: