Target
Cytochrome P450 3A4
Ligand
BDBM7886
Substrate
Meas. Tech.
In vitro CYP3A4 Inhibition Assay
IC50
1000±n/a nM
Citation
 Bareja, SPJones, SDOblong, JEMills, KJBierman, JC Cosmetic compositions containing substituted azole and methods for alleviating the signs of photoaged skin US Patent  US9144538 Publication Date 9/29/2015 
Target
Name:
Cytochrome P450 3A4
Synonyms:
Albendazole monooxygenase CP3A4_HUMAN CYP3A4 CYPIIIA4 Cytochrome P450 3A4 (CYP3A4) Nifedipine oxidase Taurochenodeoxycholate 6-alpha-hydroxylase
Type:
Enzyme
Mol. Mass.:
57349.57
Organism:
Homo sapiens (Human)
Description:
Residue:
503
  
Inhibitor
Name:
BDBM7886
Synonyms:
1-PIM 1-phenylimidazole US9138393, 1-Phenyl- imidazole | US9144538, 1-Phenylimidazole
Type:
Small organic molecule
Emp. Form.:
C9H8N2
Mol. Mass.:
144.1732
SMILES:
c1cn(cn1)-c1ccccc1
: