Target
Cytochrome P450 3A4
Ligand
BDBM21492
Substrate
Meas. Tech.
In vitro CYP3A4 Inhibition Assay
IC50
>10000±n/a nM
Citation
 Bareja, SPJones, SDOblong, JEMills, KJBierman, JC Cosmetic compositions containing substituted azole and methods for alleviating the signs of photoaged skin US Patent  US9144538 Publication Date 9/29/2015 
Target
Name:
Cytochrome P450 3A4
Synonyms:
Albendazole monooxygenase CP3A4_HUMAN CYP3A4 CYPIIIA4 Cytochrome P450 3A4 (CYP3A4) Nifedipine oxidase Taurochenodeoxycholate 6-alpha-hydroxylase
Type:
Enzyme
Mol. Mass.:
57349.57
Organism:
Homo sapiens (Human)
Description:
Residue:
503
  
Inhibitor
Name:
BDBM21492
Synonyms:
4-[3-(pyridin-2-yl)-1H-pyrazol-4-yl]quinoline LY364947 US9138393, LY-364947 | US9144538, LY-364947
Type:
Small organic molecule
Emp. Form.:
C17H12N4
Mol. Mass.:
272.304
SMILES:
c1[nH]nc(c1-c1ccnc2ccccc12)-c1ccccn1
: