Target
RAC-alpha serine/threonine-protein kinase
Ligand
BDBM182513
Substrate
Meas. Tech.
AKT Enzyme Assay
pH
7.5±n/a
IC50
180±n/a nM
Comments
extracted
Citation
 Lan, RHuck, BRXiao, YChen, XDeselm, LCQiu, HNeagu, CBankston, DJones, CC Imidazole amines as modulators of kinase activity US Patent  US9145392 Publication Date 9/29/2015 
Target
Name:
RAC-alpha serine/threonine-protein kinase
Synonyms:
AKT phosphorylation (p-AKT) AKT1/PPP1CA C-AKT PKB alpha Protein kinase B Protein kinase B (Akt 1) Protein kinase B alpha Proto-oncogene Akt (Akt1) Proto-oncogene c-Akt (AKT1) RAC-PK-alpha RAC-alpha serine/threonine-protein kinase (AKT1) | RAC-alpha serine/threonine-protein kinase (pAKT)
Type:
Enzyme
Mol. Mass.:
55681.25
Organism:
Homo sapiens (Human)
Description:
P31749
Residue:
480
  
Inhibitor
Name:
BDBM182513
Synonyms:
US9145392, 214
Type:
Small organic molecule
Emp. Form.:
C25H29F4N7
Mol. Mass.:
503.5383
SMILES:
Nc1cc(ncn1)N1CCC(CC1)c1nc(cn1CCN1CCCC1)-c1ccc(F)c(c1)C(F)(F)F
: