Target
RAC-alpha serine/threonine-protein kinase
Ligand
BDBM182642
Substrate
Meas. Tech.
AKT Enzyme Assay
pH
7.5±n/a
IC50
170±n/a nM
Comments
extracted
Citation
 Lan, RHuck, BRXiao, YChen, XDeselm, LCQiu, HNeagu, CBankston, DJones, CC Imidazole amines as modulators of kinase activity US Patent  US9145392 Publication Date 9/29/2015 
Target
Name:
RAC-alpha serine/threonine-protein kinase
Synonyms:
AKT phosphorylation (p-AKT) AKT1/PPP1CA C-AKT PKB alpha Protein kinase B Protein kinase B (Akt 1) Protein kinase B alpha Proto-oncogene Akt (Akt1) Proto-oncogene c-Akt (AKT1) RAC-PK-alpha RAC-alpha serine/threonine-protein kinase (AKT1) | RAC-alpha serine/threonine-protein kinase (pAKT)
Type:
Enzyme
Mol. Mass.:
55681.25
Organism:
Homo sapiens (Human)
Description:
P31749
Residue:
480
  
Inhibitor
Name:
BDBM182642
Synonyms:
US9145392, 343
Type:
Small organic molecule
Emp. Form.:
C27H37N9O
Mol. Mass.:
503.6424
SMILES:
CC(C)(C)c1cc(ccn1)-c1cn(CCN2CCC2)c(n1)C1CCN(CC1)c1ncnc(N)c1C(N)=O
: