Target
Aurora kinase B
Ligand
BDBM182798
Substrate
Meas. Tech.
Aurora B Kinase Inhibition Assay
pH
7.4±n/a
Temperature
298.15±n/a K
IC50
420±0.0 nM
Comments
extracted
Citation
 Sakamoto, TMita, TShibata, KOgino, YKomatani, H 1,2,4-triazine-6-carboxamide derivative US Patent  US9145414 Publication Date 9/29/2015 
Target
Name:
Aurora kinase B
Synonyms:
AIK2 AIM1 ARK2 AURKB_HUMAN Aurora B-INCENP Aurora kinase B (AURKB) STK-1 STK12 Serine/threonine-protein kinase aurora B
Type:
Protein
Mol. Mass.:
39327.72
Organism:
Homo sapiens (Human)
Description:
Q96GD4
Residue:
344
  
Inhibitor
Name:
BDBM182798
Synonyms:
US9145414, 161
Type:
Small organic molecule
Emp. Form.:
C18H21N7OS
Mol. Mass.:
383.471
SMILES:
N[C@H]1CCCC[C@H]1Nc1nnc(C(N)=O)c(Nc2cc3ccccc3s2)n1
: