Target
Sphingosine 1-phosphate receptor 3
Ligand
BDBM50313343
Substrate
Meas. Tech.
35S-GTPgammaS Binding
pH
7.4±n/a
Temperature
303.15±n/a K
EC50
2470±n/a nM
Comments
extracted
Citation
 Bombrun, ASchwarz, MCrosignani, SCovini, DMarin, D 6-amino-pyrimidine-4-carboxamide derivatives and related compounds which bind to the sphingosine 1-phosphate (S1P) receptor for the treatment of multiple sclerosis US Patent  US9150519 Publication Date 10/6/2015 
Target
Name:
Sphingosine 1-phosphate receptor 3
Synonyms:
C9orf108 EDG3 S1P receptor 3 S1P3 S1PR3_HUMAN Sphingosine 1-phosphate receptor 3 (S1P3) | Sphingosine 1-phosphate receptor Edg-3
Type:
G Protein-Coupled Receptor (GPCR)
Mol. Mass.:
42278.13
Organism:
Homo sapiens (Human)
Description:
Q99500
Residue:
378
  
Inhibitor
Name:
BDBM50313343
Synonyms:
6-(cyclohexyl(cyclopropylmethyl)amino)-N-(2-methyl-4-(N-methylsulfamoyl)phenyl)pyrimidine-4-carboxamide US9150519, 1-105
Type:
Small organic molecule
Emp. Form.:
C23H31N5O3S
Mol. Mass.:
457.589
SMILES:
CNS(=O)(=O)c1ccc(NC(=O)c2cc(ncn2)N(CC2CC2)C2CCCCC2)c(C)c1
: