Target
Epidermal growth factor receptor
Ligand
BDBM5446
Substrate
EGFR Substrate Peptide
Meas. Tech.
Kinase Inhibition Assay
pH
7.5±n/a
Temperature
296.15±n/a K
IC50
1±n/a nM
Citation
 Zhang, YMCockerill, SGuntrip, SBRusnak, DSmith, KVanderwall, DWood, ELackey, K Synthesis and SAR of potent EGFR/erbB2 dual inhibitors. Bioorg Med Chem Lett 14:111-4 (2004)  
Target
Name:
Epidermal growth factor receptor
Synonyms:
EGF Receptor Substrate EGFR_HUMAN ERBB1 Epidermal Growth Factor Receptor erbB-1 Epidermal growth factor receptor (EGFR) HER1 Proto-oncogene c-ErbB-1 Tyrosine-Protein Kinase ErbB-1
Type:
Receptor Kinase Domain
Mol. Mass.:
134279.59
Organism:
Homo sapiens (Human)
Description:
P00533
Residue:
1210
  
Inhibitor
Name:
BDBM5446
Synonyms:
CHEMBL553 Erlotinib N-(3-Ethynylphenyl)-6,7-bis(2-methoxyethoxy)-4-quinazolinamine Monohydrochloride OSI-774 US10189853, erlotinib US11524945, Compound Erlotinib US9730934, Erlotinib cid_176870
Type:
Small organic molecule
Emp. Form.:
C22H23N3O4
Mol. Mass.:
393.4357
SMILES:
COCCOc1cc2ncnc(Nc3cccc(c3)C#C)c2cc1OCCOC
:
Substrate
Name:
EGFR Substrate Peptide
Synonyms:
Type:
Peptide
Mol. Mass.:
3934.43
Organism:
Description:
10 uM ATP as co-substrate.
Residue:
34