Target
Lysosomal protective protein [29-480]
Ligand
BDBM183819
Substrate
Meas. Tech.
Inhibition Assay
pH
6±n/a
Temperature
310.15±n/a K
IC50
18±n/a nM
Comments
extracted
Citation
 Ruf, SSadowski, TWirth, KSchreuder, HBuning, CKallus, CStrobel, HWehlan, H Biaryl-propionic acid derivatives and their use as pharmaceuticals US Patent  US9150526 Publication Date 10/6/2015 
Target
Name:
Lysosomal protective protein [29-480]
Synonyms:
CTSA Cathepsin A (CTSA) PPGB_HUMAN
Type:
Mol. Mass.:
51408.15
Organism:
Homo sapiens (Human)
Description:
P10619[29-480]
Residue:
452
  
Inhibitor
Name:
BDBM183819
Synonyms:
US9150526, 72
Type:
Small organic molecule
Emp. Form.:
C22H22ClNO5S
Mol. Mass.:
447.932
SMILES:
COc1ccc(OC)c(-c2cc(Cl)cc(c2)C(CC(O)=O)c2ncc(C)s2)c1OC
: