Target
Lysosomal protective protein [29-480]
Ligand
BDBM183942
Substrate
Meas. Tech.
Inhibition Assay
pH
6±n/a
Temperature
310.15±n/a K
IC50
2±n/a nM
Comments
extracted
Citation
 Ruf, SSadowski, TWirth, KSchreuder, HBuning, CKallus, CStrobel, HWehlan, H Biaryl-propionic acid derivatives and their use as pharmaceuticals US Patent  US9150526 Publication Date 10/6/2015 
Target
Name:
Lysosomal protective protein [29-480]
Synonyms:
CTSA Cathepsin A (CTSA) PPGB_HUMAN
Type:
Mol. Mass.:
51408.15
Organism:
Homo sapiens (Human)
Description:
P10619[29-480]
Residue:
452
  
Inhibitor
Name:
BDBM183942
Synonyms:
US9150526, 205
Type:
Small organic molecule
Emp. Form.:
C21H19F3N2O5
Mol. Mass.:
436.3812
SMILES:
COc1cccc(OC)c1-c1cc(cc(c1)C(F)(F)F)C(CC(O)=O)c1nnc(C)o1
: